Target
Retinoic acid receptor RXR-alpha
Ligand
BDBM50018001
Substrate
Meas. Tech.
ChEMBL_1365631 (CHEMBL3297478)
EC50
>1000±n/a nM
Citation
 Atigadda, VRXia, GDesphande, ABoerma, LJLobo-Ruppert, SGrubbs, CJSmith, CDBrouillette, WJMuccio, DD Methyl substitution of a rexinoid agonist improves potency and reveals site of lipid toxicity. J Med Chem 57:5370-80 (2014)  
Target
Name:
Retinoic acid receptor RXR-alpha
Synonyms:
NR2B Channel Blocker RXRA_RAT Retinoid X receptor alpha | Rxra
Type:
Enzyme Catalytic Domain
Mol. Mass.:
51273.78
Organism:
RAT
Description:
NR2B Channel Blocker 0 RAT::Q05343
Residue:
467
  
Inhibitor
Name:
BDBM50018001
Synonyms:
CHEMBL3289659
Type:
Small organic molecule
Emp. Form.:
C21H24O2
Mol. Mass.:
308.4141
SMILES:
C/C(/C=C/C=C(/C)\C=C1/CCCc2ccc(C)cc12)=C\C(O)=O
: