Target
Lysosomal acid glucosylceramidase
Ligand
BDBM50018018
Substrate
Meas. Tech.
ChEMBL_1366787 (CHEMBL3297111)
Ki
7.5±n/a nM
Citation
 Zoidl, MMüller, BTorvisco, ATysoe, CBenazza, MSiriwardena, AWithers, SGWrodnigg, TM Concise synthesis of C-1-cyano-iminosugars via a new Staudinger/aza Wittig/Strecker multicomponent reaction strategy. Bioorg Med Chem Lett 24:2777-80 (2014)  
Target
Name:
Lysosomal acid glucosylceramidase
Synonyms:
Acid beta-glucosidase Beta-glucocerebrosidase D-glucosyl-N-acylsphingosine glucohydrolase GBA1 GC GLUC Glucosylceramidase (GBA) Glucosylceramidase precursor (Beta-glucocerebrosidase) (Acid beta-glucosidase) (D-glucosyl-N-acylsphingosine glucohydrolase) (Alglucerase) (Imiglucerase) beta-glucocerebrosidase (GCase)
Type:
Enzyme
Mol. Mass.:
59724.64
Organism:
Homo sapiens (Human)
Description:
The beta-Glu activity was measured with commercially available beta-glucocerebrosidase (Ceredase) as the enzyme source.
Residue:
536
  
Inhibitor
Name:
BDBM50018018
Synonyms:
CHEMBL3289679
Type:
Small organic molecule
Emp. Form.:
C18H25N3O5S
Mol. Mass.:
395.473
SMILES:
CN(C)c1cccc2c(cccc12)S(=O)(=O)NC[C@H]1NC[C@@H](O)[C@H](O)[C@H]1O
: