Target
Adenosylhomocysteinase
Ligand
BDBM50018514
Substrate
Meas. Tech.
ChEMBL_1362083 (CHEMBL3294636)
IC50
9.4±n/a nM
Citation
 Converso, AHartingh, TFraley, MEGarbaccio, RMHartman, GDHuang, SYMajercak, JMMcCampbell, ANa, SJRay, WJSavage, MJWolffe, CYeh, SYu, YWhite, RZhang, R Adenosine analogue inhibitors of S-adenosylhomocysteine hydrolase. Bioorg Med Chem Lett 24:2737-40 (2014)  
Target
Name:
Adenosylhomocysteinase
Synonyms:
AHCY SAHH | SAHH_HUMAN
Type:
PROTEIN
Mol. Mass.:
47714.06
Organism:
Homo sapiens (Human)
Description:
ChEMBL_1507791
Residue:
432
  
Inhibitor
Name:
BDBM50018514
Synonyms:
CHEMBL3290663
Type:
Small organic molecule
Emp. Form.:
C11H13FN4O3
Mol. Mass.:
268.2443
SMILES:
Nc1ncc(F)c2n(cnc12)[C@@H]1C[C@H](O)[C@@H](O)[C@H]1O
: