Target
Beta-2 adrenergic receptor
Ligand
BDBM50018589
Substrate
Meas. Tech.
ChEMBL_1362117 (CHEMBL3294889)
EC50
0.125893±n/a nM
Citation
 Jacobsen, JRAggen, JBChurch, TJKlein, UPfeiffer, JWPulido-Rios, TMThomas, GRYu, CMoran, EJ Multivalent design of long-actingß(2)-adrenoceptor agonists incorporating biarylamines. Bioorg Med Chem Lett 24:2625-30 (2014)  
Target
Name:
Beta-2 adrenergic receptor
Synonyms:
ADRB2 ADRB2_HUMAN Beta-2 adrenoceptor | Beta-2 adrenoreceptor
Type:
Mol. Mass.:
46461.69
Organism:
Homo sapiens (Human)
Description:
P07550
Residue:
413
  
Inhibitor
Name:
BDBM50018589
Synonyms:
CHEMBL3290999
Type:
Small organic molecule
Emp. Form.:
C32H31N3O4
Mol. Mass.:
521.6062
SMILES:
COc1ccc(Nc2ccc(CCNC[C@H](O)c3ccc(O)c4[nH]c(=O)ccc34)cc2)cc1-c1ccccc1
: