Target
D(3) dopamine receptor
Ligand
BDBM50018950
Substrate
Meas. Tech.
ChEMBL_1364911 (CHEMBL3295082)
Ki
2.0±n/a nM
Citation
 Möller, DKling, RCSkultety, MLeuner, KHübner, HGmeiner, P Functionally selective dopamine D2, D3 receptor partial agonists. J Med Chem 57:4861-75 (2014)  
Target
Name:
D(3) dopamine receptor
Synonyms:
DOPAMINE D3 DRD3_HUMAN Dopamine D3 receptor (D3) Dopamine receptor Dopamine receptor D3
Type:
Mol. Mass.:
44243.43
Organism:
Homo sapiens (Human)
Description:
Residue:
400
  
Inhibitor
Name:
BDBM50018950
Synonyms:
CHEMBL3287399
Type:
Small organic molecule
Emp. Form.:
C22H24Cl2N4O2
Mol. Mass.:
447.358
SMILES:
Clc1cccc(N2CCN(CCCCOc3ccc4c(C=O)cnn4c3)CC2)c1Cl
: