Target
D(2) dopamine receptor
Ligand
BDBM50018950
Substrate
Meas. Tech.
ChEMBL_1365262 (CHEMBL3293227)
EC50
340±n/a nM
Citation
 Möller, DKling, RCSkultety, MLeuner, KHübner, HGmeiner, P Functionally selective dopamine D2, D3 receptor partial agonists. J Med Chem 57:4861-75 (2014)  
Target
Name:
D(2) dopamine receptor
Synonyms:
D(2) dopamine receptor DOPAMINE D2 Long DRD2 Dopamine D2 receptor Dopamine D2 receptor (D2R) Dopamine2-like | d2
Type:
Cell-surface receptors
Mol. Mass.:
50647.10
Organism:
Homo sapiens (Human)
Description:
P14416
Residue:
443
  
Inhibitor
Name:
BDBM50018950
Synonyms:
CHEMBL3287399
Type:
Small organic molecule
Emp. Form.:
C22H24Cl2N4O2
Mol. Mass.:
447.358
SMILES:
Clc1cccc(N2CCN(CCCCOc3ccc4c(C=O)cnn4c3)CC2)c1Cl
: