Target
Acrosin
Ligand
BDBM50018986
Substrate
Meas. Tech.
ChEMBL_1365286 (CHEMBL3292380)
IC50
26800±n/a nM
Citation
 Zhao, JTian, WQi, JLv, DLiu, YJiang, YDong, GChen, QZhou, YZhu, JWang, HSheng, CLv, J Design and synthesis of phenylisoxazole derivatives as novel human acrosin inhibitors. Bioorg Med Chem Lett 24:2802-6 (2014)  
Target
Name:
Acrosin
Synonyms:
ACR ACRS
Type:
PROTEIN
Mol. Mass.:
45865.48
Organism:
Homo sapiens (Human)
Description:
ChEMBL_1365286
Residue:
421
  
Inhibitor
Name:
BDBM50018986
Synonyms:
CHEMBL3287457
Type:
Small organic molecule
Emp. Form.:
C17H15Cl2N5O2
Mol. Mass.:
392.239
SMILES:
Cl.NC(=N)Nc1ccc(cc1)-c1cc(no1)C(=O)Nc1ccc(Cl)cc1
: