Target
Free fatty acid receptor 1
Ligand
BDBM22496
Substrate
Meas. Tech.
ChEMBL_1361427 (CHEMBL3294051)
EC50
99±n/a nM
Citation
 Takano, RYoshida, MInoue, MHonda, TNakashima, RMatsumoto, KYano, TOgata, TWatanabe, NToda, N Discovery of 3-aryl-3-ethoxypropanoic acids as orally active GPR40 agonists. Bioorg Med Chem Lett 24:2949-53 (2014)  
Target
Name:
Free fatty acid receptor 1
Synonyms:
FFAR1_RAT G-protein coupled receptor 40 | Gpr40
Type:
PROTEIN
Mol. Mass.:
31848.38
Organism:
Rattus norvegicus
Description:
ChEMBL_1511162
Residue:
300
  
Inhibitor
Name:
BDBM22496
Synonyms:
3-(4-{[(3-phenoxyphenyl)methyl]amino}phenyl)propanoic acid carboxylic acid agonist, 2
Type:
Small organic molecule
Emp. Form.:
C22H21NO3
Mol. Mass.:
347.407
SMILES:
OC(=O)CCc1ccc(NCc2cccc(Oc3ccccc3)c2)cc1
: