Target
Free fatty acid receptor 1
Ligand
BDBM50019110
Substrate
Meas. Tech.
ChEMBL_1361427 (CHEMBL3294051)
EC50
79±n/a nM
Citation
 Takano, RYoshida, MInoue, MHonda, TNakashima, RMatsumoto, KYano, TOgata, TWatanabe, NToda, N Discovery of 3-aryl-3-ethoxypropanoic acids as orally active GPR40 agonists. Bioorg Med Chem Lett 24:2949-53 (2014)  
Target
Name:
Free fatty acid receptor 1
Synonyms:
FFAR1_RAT G-protein coupled receptor 40 | Gpr40
Type:
PROTEIN
Mol. Mass.:
31848.38
Organism:
Rattus norvegicus
Description:
ChEMBL_1511162
Residue:
300
  
Inhibitor
Name:
BDBM50019110
Synonyms:
CHEMBL3288362
Type:
Small organic molecule
Emp. Form.:
C19H22O4
Mol. Mass.:
314.3756
SMILES:
CCOC(CC(O)=O)c1ccc(OCc2ccccc2C)cc1
: