Target
DNA-directed RNA polymerase I subunit RPA1
Ligand
BDBM50019322
Substrate
Meas. Tech.
ChEMBL_1362895 (CHEMBL3291669)
IC50
1090±n/a nM
Citation
 Colis, LErnst, GSanders, SLiu, HSirajuddin, PPeltonen, KDePasquale, MBarrow, JCLaiho, M Design, synthesis, and structure-activity relationships of pyridoquinazolinecarboxamides as RNA polymerase I inhibitors. J Med Chem 57:4950-61 (2014)  
Target
Name:
DNA-directed RNA polymerase I subunit RPA1
Synonyms:
A190 DNA-directed RNA polymerase I subunit A RNA polymerase I 194 kDa subunit RPA194 | RPA1_HUMAN
Type:
PROTEIN
Mol. Mass.:
194822.12
Organism:
Homo sapiens (Human)
Description:
ChEMBL_108369
Residue:
1720
  
Inhibitor
Name:
BDBM50019322
Synonyms:
CHEMBL3289427
Type:
Small organic molecule
Emp. Form.:
C24H25N5O2
Mol. Mass.:
415.4876
SMILES:
CN1CCN(CCNC(=O)c2cccn3c2nc2cc4ccccc4cc2c3=O)CC1
: