Target
Neurotensin receptor type 2
Ligand
BDBM50248034
Substrate
Meas. Tech.
ChEMBL_1364514 (CHEMBL3295311)
EC50
120±n/a nM
Citation
 Thomas, JBGiddings, AMWiethe, RWOlepu, SWarner, KRSarret, PGendron, LLongpre, JMZhang, YRunyon, SPGilmour, BP Identification of 1-({[1-(4-fluorophenyl)-5-(2-methoxyphenyl)-1H-pyrazol-3-yl]carbonyl}amino)cyclohexane carboxylic acid as a selective nonpeptide neurotensin receptor type 2 compound. J Med Chem 57:5318-32 (2014)  
Target
Name:
Neurotensin receptor type 2
Synonyms:
High-affinity levocabastine-sensitive neurotensin receptor NTR2_RAT Neurotensin receptor type 2 Ntsr2
Type:
PROTEIN
Mol. Mass.:
46280.50
Organism:
Rattus norvegicus
Description:
ChEMBL_1466615
Residue:
416
  
Inhibitor
Name:
BDBM50248034
Synonyms:
2-{[1-(7-Chloro-quinolin-4-yl)-5-(2,6-dimethoxy-phenyl)-1H-pyrazole-3-carbonyl]-amino}-adamantane-2-carboxylic acid SR 48692
Type:
Small organic molecule
Emp. Form.:
C32H31ClN4O5
Mol. Mass.:
587.065
SMILES:
COc1cccc(OC)c1-c1cc(nn1-c1ccnc2cc(Cl)ccc12)C(=O)NC1(C2CC3CC(C2)CC1C3)C(O)=O
: