Target
Neurotensin receptor type 2
Ligand
BDBM50019414
Substrate
Meas. Tech.
ChEMBL_1364514 (CHEMBL3295311)
EC50
62±n/a nM
Citation
 Thomas, JBGiddings, AMWiethe, RWOlepu, SWarner, KRSarret, PGendron, LLongpre, JMZhang, YRunyon, SPGilmour, BP Identification of 1-({[1-(4-fluorophenyl)-5-(2-methoxyphenyl)-1H-pyrazol-3-yl]carbonyl}amino)cyclohexane carboxylic acid as a selective nonpeptide neurotensin receptor type 2 compound. J Med Chem 57:5318-32 (2014)  
Target
Name:
Neurotensin receptor type 2
Synonyms:
High-affinity levocabastine-sensitive neurotensin receptor NTR2_RAT Neurotensin receptor type 2 Ntsr2
Type:
PROTEIN
Mol. Mass.:
46280.50
Organism:
Rattus norvegicus
Description:
ChEMBL_1466615
Residue:
416
  
Inhibitor
Name:
BDBM50019414
Synonyms:
CHEMBL3290098
Type:
Small organic molecule
Emp. Form.:
C27H25ClN4O4
Mol. Mass.:
504.965
SMILES:
COc1ccccc1-c1cc(nn1-c1ccnc2cc(Cl)ccc12)C(=O)NC1(CCCCC1)C(O)=O
: