Target
Neurotensin receptor type 2
Ligand
BDBM50019423
Substrate
Meas. Tech.
ChEMBL_1364514 (CHEMBL3295311)
EC50
19±n/a nM
Citation
 Thomas, JBGiddings, AMWiethe, RWOlepu, SWarner, KRSarret, PGendron, LLongpre, JMZhang, YRunyon, SPGilmour, BP Identification of 1-({[1-(4-fluorophenyl)-5-(2-methoxyphenyl)-1H-pyrazol-3-yl]carbonyl}amino)cyclohexane carboxylic acid as a selective nonpeptide neurotensin receptor type 2 compound. J Med Chem 57:5318-32 (2014)  
Target
Name:
Neurotensin receptor type 2
Synonyms:
High-affinity levocabastine-sensitive neurotensin receptor NTR2_RAT Neurotensin receptor type 2 Ntsr2
Type:
PROTEIN
Mol. Mass.:
46280.50
Organism:
Rattus norvegicus
Description:
ChEMBL_1466615
Residue:
416
  
Inhibitor
Name:
BDBM50019423
Synonyms:
CHEMBL3290105
Type:
Small organic molecule
Emp. Form.:
C25H26FN3O5
Mol. Mass.:
467.4894
SMILES:
COc1cccc(OC)c1-c1cc(nn1-c1ccc(F)cc1)C(=O)NC1(CCCCC1)C(O)=O
: