Target
Cytochrome P450 11B1, mitochondrial
Ligand
BDBM50019872
Substrate
Meas. Tech.
ChEMBL_1361875 (CHEMBL3293050)
IC50
61±n/a nM
Citation
 Yin, LHu, QEmmerich, JLo, MMMetzger, EAli, AHartmann, RW Novel pyridyl- or isoquinolinyl-substituted indolines and indoles as potent and selective aldosterone synthase inhibitors. J Med Chem 57:5179-89 (2014)  
Target
Name:
Cytochrome P450 11B1, mitochondrial
Synonyms:
C11B1_HUMAN CYPXIB1 Cytochrome P450 11B1 Cytochrome P450 11B1, mitochondrial | S11BH
Type:
Enzyme
Mol. Mass.:
57591.44
Organism:
Homo sapiens (Human)
Description:
P15538
Residue:
503
  
Inhibitor
Name:
BDBM50019872
Synonyms:
CHEMBL3287193
Type:
Small organic molecule
Emp. Form.:
C16H14N2O
Mol. Mass.:
250.2952
SMILES:
CC(=O)n1ccc2cc(ccc12)-c1cnccc1C
: