Target
Cytochrome P450 11B2, mitochondrial
Ligand
BDBM50019886
Substrate
Meas. Tech.
ChEMBL_1361874 (CHEMBL3293049)
IC50
0.700000±n/a nM
Citation
 Yin, LHu, QEmmerich, JLo, MMMetzger, EAli, AHartmann, RW Novel pyridyl- or isoquinolinyl-substituted indolines and indoles as potent and selective aldosterone synthase inhibitors. J Med Chem 57:5179-89 (2014)  
Target
Name:
Cytochrome P450 11B2, mitochondrial
Synonyms:
Aldosterone Synthase (CYP11B2) Aldosterone-synthesizing enzyme CYP11B2 Cytochrome P450 11B2 Cytochrome P450 11B2, mitochondrial P-450C18 | Steroid 18-hydroxylase
Type:
Protein
Mol. Mass.:
57582.15
Organism:
Homo sapiens (Human)
Description:
P19099
Residue:
503
  
Inhibitor
Name:
BDBM50019886
Synonyms:
CHEMBL3287178 | US9745282, 28
Type:
Small organic molecule
Emp. Form.:
C19H16N2O
Mol. Mass.:
288.3431
SMILES:
CC(=O)N1CCc2cc(ccc12)-c1cncc2ccccc12
: