Target
Tyrosine-protein kinase Fyn
Ligand
BDBM50020310
Substrate
Meas. Tech.
ChEMBL_1365415 (CHEMBL3296774)
Ki
1800±n/a nM
Citation
 Zhang, LZheng, QYang, YZhou, HGong, XZhao, SFan, C Synthesis and in vivo SAR study of indolin-2-one-based multi-targeted inhibitors as potential anticancer agents. Eur J Med Chem 82:139-51 (2014)  
Target
Name:
Tyrosine-protein kinase Fyn
Synonyms:
FYN Proto-oncogene Syn SLK Src-like kinase | p59-Fyn
Type:
Enzyme
Mol. Mass.:
60762.21
Organism:
Homo sapiens (Human)
Description:
P06241
Residue:
537
  
Inhibitor
Name:
BDBM50020310
Synonyms:
CHEMBL3288854
Type:
Small organic molecule
Emp. Form.:
C23H28FN5O2
Mol. Mass.:
425.4991
SMILES:
CN1CCN(CCC(=O)Nc2c(C)[nH]c(\C=C3/C(=O)Nc4ccc(F)cc34)c2C)CC1
: