Target
Signal transducer and activator of transcription 3
Ligand
BDBM50020585
Substrate
Meas. Tech.
ChEMBL_1361573 (CHEMBL3295140)
IC50
19400±n/a nM
Citation
 Koeberle, AMuņoz, EAppendino, GBMinassi, APace, SRossi, AWeinigel, CBarz, DSautebin, LCaprioglio, DCollado, JAWerz, O SAR studies on curcumin's pro-inflammatory targets: discovery of prenylated pyrazolocurcuminoids as potent and selective novel inhibitors of 5-lipoxygenase. J Med Chem 57:5638-48 (2014)  
Target
Name:
Signal transducer and activator of transcription 3
Synonyms:
APRF STAT3_HUMAN Signal transducer and activator of transcription 3 (STAT3)
Type:
Protein
Mol. Mass.:
88064.31
Organism:
Homo sapiens (Human)
Description:
P40763
Residue:
770
  
Inhibitor
Name:
BDBM50020585
Synonyms:
CHEMBL3290186
Type:
Small organic molecule
Emp. Form.:
C19H16F2O5
Mol. Mass.:
362.3241
SMILES:
COc1cc(\C=C\C(=O)\C=C\c2cc(F)c(O)c(OC)c2)cc(F)c1O
: