Target
Bcl-2-like protein 1
Ligand
BDBM50020929
Substrate
Meas. Tech.
ChEMBL_1365047 (CHEMBL3291803)
Kd
38±n/a nM
Citation
 Koehler, MFBergeron, PChoo, EFLau, KNdubaku, CDudley, DGibbons, PSleebs, BERye, CSNikolakopoulos, GBui, CKulasegaram, SKersten, WJSmith, BJCzabotar, PEColman, PMHuang, DCBaell, JBWatson, KGHasvold, LTao, ZFWang, LSouers, AJElmore, SWFlygare, JAFairbrother, WJLessene, G Structure-Guided Rescaffolding of Selective Antagonists of BCL-XL. ACS Med Chem Lett 5:662-7 (2014)  
Target
Name:
Bcl-2-like protein 1
Synonyms:
Anti-apoptotic Bcl-2 protein Apoptosis regulator Bcl-X BCL2-like 1 isoform 1 BCL2L1 Bcl-2-like protein 1 (Bcl-XL) Bcl-xL/Bcl-2-binding component 3 Bcl2-antagonist of cell death (BAD)
Type:
Mitochondrion membrane; Single-pass membrane protein
Mol. Mass.:
26039.60
Organism:
Homo sapiens (Human)
Description:
Residue:
233
  
Inhibitor
Name:
BDBM50020929
Synonyms:
CHEMBL3287292
Type:
Small organic molecule
Emp. Form.:
C23H18N4O3S
Mol. Mass.:
430.479
SMILES:
OC(=O)c1cccc(n1)N1CCc2cccc(C(=O)Nc3nc4ccccc4s3)c2C1
: