Target
Somatostatin receptor type 3
Ligand
BDBM50369890
Substrate
Meas. Tech.
ChEMBL_1365873 (CHEMBL3296531)
Ki
0.640000±n/a nM
Citation
 Li, DWu, ZYu, YBall, RGGuo, LSherer, EHe, SHong, QLai, ZQi, HTruong, QYang, DXChicchi, GGTsao, KLTrusca, DTrujillo, MPachanski, MEiermann, GJHoward, ADZhou, YPZhang, BBNargund, RPHagmann, WK Diamine Derivatives as Novel Small-Molecule, Potent, and Subtype-Selective Somatostatin SST3 Receptor Agonists. ACS Med Chem Lett 5:690-5 (2014)  
Target
Name:
Somatostatin receptor type 3
Synonyms:
SOMATOSTATIN SST3 SS3-R SSR-28 SSTR3 | Somatostatin receptor type 3 (SSTR3)
Type:
Protein
Mol. Mass.:
45855.97
Organism:
Homo sapiens (Human)
Description:
P32745
Residue:
418
  
Inhibitor
Name:
BDBM50369890
Synonyms:
CHEMBL1237140 | CHEMBL1788167
Type:
Small organic molecule
Emp. Form.:
C28H34N4
Mol. Mass.:
426.5964
SMILES:
CCCCC1(CCCC)N[C@@H](Cc2c1[nH]c1ccccc21)c1nc(c[nH]1)-c1ccccc1
: