Target
Interleukin-2
Ligand
BDBM50021400
Substrate
Meas. Tech.
ChEMBL_1363478 (CHEMBL3291700)
Kd
0.029±n/a nM
Citation
 Chen, LDu, JDai, QZhang, HPang, WHu, J Prediction of anti-tumor chemical probes of a traditional Chinese medicine formula by HPLC fingerprinting combined with molecular docking. Eur J Med Chem 83:294-306 (2014)  
Target
Name:
Interleukin-2
Synonyms:
IL-2 IL2_HUMAN Interleukin-2 T-cell growth factor | TCGF
Type:
Enzyme
Mol. Mass.:
17630.05
Organism:
Homo sapiens (Human)
Description:
P60568
Residue:
153
  
Inhibitor
Name:
BDBM50021400
Synonyms:
CHEBI:74020 | DISOGLUSIDE
Type:
Small organic molecule
Emp. Form.:
C33H52O8
Mol. Mass.:
576.7612
SMILES:
[H][C@]12C[C@@]3([H])[C@]4([H])CC=C5C[C@H](CC[C@]5(C)[C@@]4([H])CC[C@]3(C)[C@@]1([H])[C@H](C)[C@@]1(CC[C@@H](C)CO1)O2)O[C@]1([H])O[C@H](CO)[C@@H](O)[C@H](O)[C@H]1O
: