Target
Hepatocyte growth factor receptor
Ligand
BDBM50383191
Substrate
Meas. Tech.
ChEMBL_1364714 (CHEMBL3293756)
IC50
1.000000±n/a nM
Citation
 Zhou, SLiao, HHe, CDou, YJiang, MRen, LZhao, YGong, P Design, synthesis and structure-activity relationships of novel 4-phenoxyquinoline derivatives containing pyridazinone moiety as potential antitumor agents. Eur J Med Chem 83:581-93 (2014)  
Target
Name:
Hepatocyte growth factor receptor
Synonyms:
Hepatocyte growth factor receptor Hepatocyte growth factor receptor (c-MET) MET Met proto-oncogene (hepatocyte growth factor receptor) Tyrosine-protein kinase Met (c-Met) c-Met kinase
Type:
Protein
Mol. Mass.:
155559.73
Organism:
Homo sapiens (Human)
Description:
P08581
Residue:
1390
  
Inhibitor
Name:
BDBM50383191
Synonyms:
CHEMBL2031893
Type:
Small organic molecule
Emp. Form.:
C29H25FN4O5
Mol. Mass.:
528.531
SMILES:
COc1cc2nccc(Oc3ccc(NC(=O)c4c(C)n(C)n(-c5ccccc5)c4=O)cc3F)c2cc1OC
: