Target
Cyclin-dependent kinase 2
Ligand
BDBM50021625
Substrate
Meas. Tech.
ChEMBL_1367966 (CHEMBL3300811)
IC50
60±n/a nM
Citation
 Casuscelli, FArdini, EAvanzi, NCasale, ECervi, GD'Anello, MDonati, DFaiardi, DFerguson, RDFogliatto, GGalvani, AMarsiglio, AMirizzi, DGMontemartini, MOrrenius, CPapeo, GPiutti, CSalom, BFelder, ER Discovery and optimization of pyrrolo[1,2-a]pyrazinones leads to novel and selective inhibitors of PIM kinases. Bioorg Med Chem 21:7364-80 (2013)  
Target
Name:
Cyclin-dependent kinase 2
Synonyms:
CDK2 CDK2_HUMAN Cell division protein kinase 2 Protein cereblon/Cyclin-dependent kinase 2 | p33 protein kinase
Type:
Enzyme Subunit
Mol. Mass.:
33938.17
Organism:
Homo sapiens (Human)
Description:
P24941
Residue:
298
  
Inhibitor
Name:
BDBM50021625
Synonyms:
CHEMBL3298823
Type:
Small organic molecule
Emp. Form.:
C19H18FN5O2
Mol. Mass.:
367.3769
SMILES:
Fc1cccc(CNC(=O)CC2CNC(=O)c3cc(cn23)-c2cn[nH]c2)c1
: