Target
Tyrosine-protein kinase JAK1
Ligand
BDBM50021626
Substrate
Meas. Tech.
ChEMBL_1368035 (CHEMBL3300962)
IC50
>10000±n/a nM
Citation
 Casuscelli, FArdini, EAvanzi, NCasale, ECervi, GD'Anello, MDonati, DFaiardi, DFerguson, RDFogliatto, GGalvani, AMarsiglio, AMirizzi, DGMontemartini, MOrrenius, CPapeo, GPiutti, CSalom, BFelder, ER Discovery and optimization of pyrrolo[1,2-a]pyrazinones leads to novel and selective inhibitors of PIM kinases. Bioorg Med Chem 21:7364-80 (2013)  
Target
Name:
Tyrosine-protein kinase JAK1
Synonyms:
JAK-1 JAK1A JAK1_HUMAN Janus kinase 1 (JAK1) | Janus kinase 1 JAK1
Type:
Protein
Mol. Mass.:
133293.73
Organism:
Homo sapiens (Human)
Description:
P23458
Residue:
1154
  
Inhibitor
Name:
BDBM50021626
Synonyms:
CHEMBL3298400
Type:
Small organic molecule
Emp. Form.:
C18H23N3O2S
Mol. Mass.:
345.459
SMILES:
CC(C)(C)CNC(=O)CC1CNC(=O)c2cc(cn12)-c1ccsc1
: