Target
High affinity nerve growth factor receptor
Ligand
BDBM50021626
Substrate
Meas. Tech.
ChEMBL_1368006 (CHEMBL3300851)
IC50
>10000±n/a nM
Citation
 Casuscelli, FArdini, EAvanzi, NCasale, ECervi, GD'Anello, MDonati, DFaiardi, DFerguson, RDFogliatto, GGalvani, AMarsiglio, AMirizzi, DGMontemartini, MOrrenius, CPapeo, GPiutti, CSalom, BFelder, ER Discovery and optimization of pyrrolo[1,2-a]pyrazinones leads to novel and selective inhibitors of PIM kinases. Bioorg Med Chem 21:7364-80 (2013)  
Target
Name:
High affinity nerve growth factor receptor
Synonyms:
2.7.10.1 NTRK1 NTRK1_HUMAN Neurotrophic tyrosine kinase receptor type 1 Synonyms=MTC TRK1-transforming tyrosine kinase protein TRKA GN Tropomyosin alpha-3 chain/High affinity nerve growth factor receptor Tropomyosin-related kinase A (TrkA) Tyrosine kinase receptor (Trk) Tyrosine kinase receptor A (Trk A) Tyrosine kinase receptor A (TrkA) p140-TrkA
Type:
Mol. Mass.:
87498.18
Organism:
Homo sapiens (Human)
Description:
P04629
Residue:
796
  
Inhibitor
Name:
BDBM50021626
Synonyms:
CHEMBL3298400
Type:
Small organic molecule
Emp. Form.:
C18H23N3O2S
Mol. Mass.:
345.459
SMILES:
CC(C)(C)CNC(=O)CC1CNC(=O)c2cc(cn12)-c1ccsc1
: