Target
Serine/threonine-protein kinase pim-1
Ligand
BDBM50021650
Substrate
Meas. Tech.
ChEMBL_1368150 (CHEMBL3301295)
IC50
16±n/a nM
Citation
 Casuscelli, FArdini, EAvanzi, NCasale, ECervi, GD'Anello, MDonati, DFaiardi, DFerguson, RDFogliatto, GGalvani, AMarsiglio, AMirizzi, DGMontemartini, MOrrenius, CPapeo, GPiutti, CSalom, BFelder, ER Discovery and optimization of pyrrolo[1,2-a]pyrazinones leads to novel and selective inhibitors of PIM kinases. Bioorg Med Chem 21:7364-80 (2013)  
Target
Name:
Serine/threonine-protein kinase pim-1
Synonyms:
PIM-1 Kinase PIM1_HUMAN Serine/threonine-protein kinase (PIM1) Serine/threonine-protein kinase PIM1 | Serine/threonine-protein kinase pim-1 (PIM1)
Type:
Protein
Mol. Mass.:
35681.82
Organism:
Homo sapiens (Human)
Description:
P11309
Residue:
313
  
Inhibitor
Name:
BDBM50021650
Synonyms:
CHEMBL3298892
Type:
Small organic molecule
Emp. Form.:
C23H28FN3O3
Mol. Mass.:
413.4851
SMILES:
OC[C@@H](NC(=O)C[C@H]1CNC(=O)c2cc(cn12)-c1cccc(F)c1)C1CCCCC1
: