Target
Serine/threonine-protein kinase pim-2
Ligand
BDBM50021650
Substrate
Meas. Tech.
ChEMBL_1367999 (CHEMBL3300844)
IC50
252±n/a nM
Citation
 Casuscelli, FArdini, EAvanzi, NCasale, ECervi, GD'Anello, MDonati, DFaiardi, DFerguson, RDFogliatto, GGalvani, AMarsiglio, AMirizzi, DGMontemartini, MOrrenius, CPapeo, GPiutti, CSalom, BFelder, ER Discovery and optimization of pyrrolo[1,2-a]pyrazinones leads to novel and selective inhibitors of PIM kinases. Bioorg Med Chem 21:7364-80 (2013)  
Target
Name:
Serine/threonine-protein kinase pim-2
Synonyms:
PIM2 Pim-2h Serine/threonine-protein kinase PIM | Serine/threonine-protein kinase pim-2 (PIM2)
Type:
Serine/threonine-protein kinase
Mol. Mass.:
34185.93
Organism:
Homo sapiens (Human)
Description:
Q9P1W9
Residue:
311
  
Inhibitor
Name:
BDBM50021650
Synonyms:
CHEMBL3298892
Type:
Small organic molecule
Emp. Form.:
C23H28FN3O3
Mol. Mass.:
413.4851
SMILES:
OC[C@@H](NC(=O)C[C@H]1CNC(=O)c2cc(cn12)-c1cccc(F)c1)C1CCCCC1
: