Target
Protein-tyrosine kinase 6
Ligand
BDBM50021618
Substrate
Meas. Tech.
ChEMBL_1368141 (CHEMBL3301286)
IC50
>10000±n/a nM
Citation
 Casuscelli, FArdini, EAvanzi, NCasale, ECervi, GD'Anello, MDonati, DFaiardi, DFerguson, RDFogliatto, GGalvani, AMarsiglio, AMirizzi, DGMontemartini, MOrrenius, CPapeo, GPiutti, CSalom, BFelder, ER Discovery and optimization of pyrrolo[1,2-a]pyrazinones leads to novel and selective inhibitors of PIM kinases. Bioorg Med Chem 21:7364-80 (2013)  
Target
Name:
Protein-tyrosine kinase 6
Synonyms:
BRK KH domain-containing, RNA-binding, signal transduction-associated protein 1 PTK6_HUMAN Tyrosine Kinase BRK Tyrosine-protein kinase BRK
Type:
Tyrosine-protein kinase
Mol. Mass.:
51839.11
Organism:
Homo sapiens (Human)
Description:
Residue:
451
  
Inhibitor
Name:
BDBM50021618
Synonyms:
CHEMBL3297762 | US9145418, 2
Type:
Small organic molecule
Emp. Form.:
C28H38ClN5O2
Mol. Mass.:
512.087
SMILES:
CN1CCN(C[C@@H](NC(=O)C[C@H]2CNC(=O)c3cc(cn23)-c2cccc(Cl)c2)C2CCCCC2)CC1
: