Target
Tyrosine-protein kinase JAK1
Ligand
BDBM50355501
Substrate
Meas. Tech.
ChEMBL_1368152 (CHEMBL3301297)
IC50
6.4±n/a nM
Citation
 Clark, JDFlanagan, METelliez, JB Discovery and development of Janus kinase (JAK) inhibitors for inflammatory diseases. J Med Chem 57:5023-38 (2014)  
Target
Name:
Tyrosine-protein kinase JAK1
Synonyms:
JAK-1 JAK1A JAK1_HUMAN Janus kinase 1 (JAK1) | Janus kinase 1 JAK1
Type:
Protein
Mol. Mass.:
133293.73
Organism:
Homo sapiens (Human)
Description:
P23458
Residue:
1154
  
Inhibitor
Name:
BDBM50355501
Synonyms:
INCB-018424 RUXOLITINIB PHOSPHATE US10766894, Compound TABLE 1.1 US11203595, TABLE 1.1 | US11279703, TABLE 6.147
Type:
Small organic molecule
Emp. Form.:
C17H18N6
Mol. Mass.:
306.365
SMILES:
N#CC[C@H](C1CCCC1)n1cc(cn1)-c1ncnc2[nH]ccc12
: