Target
Tyrosine-protein kinase JAK2
Ligand
BDBM50021655
Substrate
Meas. Tech.
ChEMBL_1368182 (CHEMBL3299230)
IC50
24±n/a nM
Citation
 Clark, JDFlanagan, METelliez, JB Discovery and development of Janus kinase (JAK) inhibitors for inflammatory diseases. J Med Chem 57:5023-38 (2014)  
Target
Name:
Tyrosine-protein kinase JAK2
Synonyms:
JAK-2 JAK2_HUMAN Janus kinase 2 (JAK2) | Janus kinase 2 (a protein tyrosine kinase)
Type:
Protein
Mol. Mass.:
130684.68
Organism:
Homo sapiens (Human)
Description:
O60674
Residue:
1132
  
Inhibitor
Name:
BDBM50021655
Synonyms:
DECERNOTINIB US10766894, Compound TABLE 1.2 VRT-831509 | VX-509
Type:
Small organic molecule
Emp. Form.:
C18H19F3N6O
Mol. Mass.:
392.3783
SMILES:
CC[C@@](C)(Nc1ccnc(n1)-c1c[nH]c2ncccc12)C(=O)NCC(F)(F)F
: