Target
Ribosomal protein S6 kinase alpha-3
Ligand
BDBM50021668
Substrate
Meas. Tech.
ChEMBL_1368328 (CHEMBL868674)
IC50
18000±n/a nM
Citation
 Costales, AMathur, MRamurthy, SLan, JSubramanian, SJain, RAtallah, GSetti, LLindvall, MAppleton, BAOrnelas, EFeucht, PWarne, BDoyle, LBasham, SEAronchik, IJefferson, ABShafer, CM 2-Amino-7-substituted benzoxazole analogs as potent RSK2 inhibitors. Bioorg Med Chem Lett 24:1592-6 (2014)  
Target
Name:
Ribosomal protein S6 kinase alpha-3
Synonyms:
90 kDa ribosomal protein S6 kinase 3 ISPK1 MAP kinase-activated protein kinase 1b RPS6KA3 RSK2 Ribosomal protein S6 kinase Ribosomal protein S6 kinase alpha-3 (RSK2) S6K-alpha 3 p90 ribosomal s6 kinase (RSK2) p90RSK | pp90RSK2
Type:
Serine/threonine-protein kinase
Mol. Mass.:
83740.03
Organism:
Homo sapiens (Human)
Description:
The human RSK2 sequence differed from the Genbank entry NM_004586 at one residue, V45G. The protein was cloned and purified from baculovirus expression system.
Residue:
740
  
Inhibitor
Name:
BDBM50021668
Synonyms:
CHEMBL3298040
Type:
Small organic molecule
Emp. Form.:
C22H19FN2O4
Mol. Mass.:
394.3957
SMILES:
COc1cc(Nc2nc3cccc(-c4ccccc4F)c3o2)cc(OC)c1OC
: