Target
Beta-2 adrenergic receptor
Ligand
BDBM50021882
Substrate
Meas. Tech.
ChEMBL_1369174 (CHEMBL862902)
Ki
20±n/a nM
Citation
 McKinnell, RMKlein, ULinsell, MSMoran, EJNodwell, MBPfeiffer, JWThomas, GRYu, CJacobsen, JR Discovery of TD-4306, a long-actingß2-agonist for the treatment of asthma and COPD. Bioorg Med Chem Lett 24:2871-6 (2014)  
Target
Name:
Beta-2 adrenergic receptor
Synonyms:
ADRB2 ADRB2_HUMAN Beta-2 adrenoceptor | Beta-2 adrenoreceptor
Type:
Mol. Mass.:
46461.69
Organism:
Homo sapiens (Human)
Description:
P07550
Residue:
413
  
Inhibitor
Name:
BDBM50021882
Synonyms:
CHEMBL3298831
Type:
Small organic molecule
Emp. Form.:
C31H36N4O5
Mol. Mass.:
544.6413
SMILES:
O[C@@H](CNCCc1ccc(Nc2ccc(OCCN3CCOCC3)cc2)cc1)c1ccc(O)c2[nH]c(=O)ccc12
: