Target
Beta-1 adrenergic receptor
Ligand
BDBM50021875
Substrate
Meas. Tech.
ChEMBL_1369176
EC50
7.9±n/a nM
Citation
 McKinnell, RMKlein, ULinsell, MSMoran, EJNodwell, MBPfeiffer, JWThomas, GRYu, CJacobsen, JR Discovery of TD-4306, a long-actingß2-agonist for the treatment of asthma and COPD. Bioorg Med Chem Lett 24:2871-6 (2014)  
Target
Name:
Beta-1 adrenergic receptor
Synonyms:
ADRB1 ADRB1_HUMAN Beta-1 adrenoceptor | adrenergic Beta1
Type:
G Protein-Coupled Receptor (GPCR)
Mol. Mass.:
51338.40
Organism:
Homo sapiens (Human)
Description:
P08588
Residue:
477
  
Inhibitor
Name:
BDBM50021875
Synonyms:
CHEMBL3298691
Type:
Small organic molecule
Emp. Form.:
C29H34N4O5
Mol. Mass.:
518.6041
SMILES:
NCCOCCOc1ccc(Nc2ccc(CCNC[C@H](O)c3ccc(O)c4[nH]c(=O)ccc34)cc2)cc1
: