Target
Chitinase
Ligand
BDBM50022824
Substrate
Meas. Tech.
ChEMBL_1369100 (CHEMBL3300321)
IC50
1810±n/a nM
Citation
 Gooyit, MTricoche, NLustigman, SJanda, KD Dual protonophore-chitinase inhibitors dramatically affect O. volvulus molting. J Med Chem 57:5792-9 (2014)  
Target
Name:
Chitinase
Synonyms:
Type:
PROTEIN
Mol. Mass.:
55694.80
Organism:
Onchocerca volvulus
Description:
ChEMBL_1369100
Residue:
497
  
Inhibitor
Name:
BDBM50022824
Synonyms:
CHEMBL3298097
Type:
Small organic molecule
Emp. Form.:
C20H15I2NO3
Mol. Mass.:
571.1469
SMILES:
CN(C(=O)c1cc(I)cc(I)c1O)c1ccc(Oc2ccccc2)cc1
: