Target
Sodium-dependent serotonin transporter
Ligand
BDBM50023161
Substrate
Meas. Tech.
ChEMBL_1367806
EC50
356±n/a nM
Citation
 Blough, BELandavazo, APartilla, JSBaumann, MHDecker, AMPage, KMRothman, RB Hybrid dopamine uptake blocker-serotonin releaser ligands: a new twist on transporter-focused therapeutics. ACS Med Chem Lett 5:623-7 (2014)  
Target
Name:
Sodium-dependent serotonin transporter
Synonyms:
5-HT Transporter 5HT transporter Anandamid membrane transporter, AMT Monoamine transporters; Norepinephrine & serotonin Slc6a4 Sodium-dependent serotonin transporter (SERT) | imipramine receptor
Type:
Multi-pass membrane protein
Mol. Mass.:
70168.43
Organism:
Rattus norvegicus (rat)
Description:
P31652
Residue:
630
  
Inhibitor
Name:
BDBM50023161
Synonyms:
CHEMBL3298870
Type:
Small organic molecule
Emp. Form.:
C12H14Cl3NO
Mol. Mass.:
294.605
SMILES:
Cl.CC(NC1CC1)C(=O)c1ccc(Cl)c(Cl)c1
: