Target
Sodium-dependent dopamine transporter
Ligand
BDBM50023178
Substrate
Meas. Tech.
ChEMBL_1367804
EC50
47±n/a nM
Citation
 Blough, BELandavazo, APartilla, JSBaumann, MHDecker, AMPage, KMRothman, RB Hybrid dopamine uptake blocker-serotonin releaser ligands: a new twist on transporter-focused therapeutics. ACS Med Chem Lett 5:623-7 (2014)  
Target
Name:
Sodium-dependent dopamine transporter
Synonyms:
DA transporter SC6A3_RAT Sodium-dependent dopamine transporter | Sodium-dependent dopamine transporter (DAT)
Type:
Multi-pass membrane protein
Mol. Mass.:
68749.45
Organism:
Rattus norvegicus (rat)
Description:
P23977
Residue:
619
  
Inhibitor
Name:
BDBM50023178
Synonyms:
CHEMBL3298873
Type:
Small organic molecule
Emp. Form.:
C10H13Cl2NO
Mol. Mass.:
234.122
SMILES:
Cl.CNC(C)C(=O)c1cccc(Cl)c1
: