Target
Sodium-dependent serotonin transporter
Ligand
BDBM50029103
Substrate
Meas. Tech.
ChEMBL_1367806
EC50
120±n/a nM
Citation
 Blough, BELandavazo, APartilla, JSBaumann, MHDecker, AMPage, KMRothman, RB Hybrid dopamine uptake blocker-serotonin releaser ligands: a new twist on transporter-focused therapeutics. ACS Med Chem Lett 5:623-7 (2014)  
Target
Name:
Sodium-dependent serotonin transporter
Synonyms:
5-HT Transporter 5HT transporter Anandamid membrane transporter, AMT Monoamine transporters; Norepinephrine & serotonin Slc6a4 Sodium-dependent serotonin transporter (SERT) | imipramine receptor
Type:
Multi-pass membrane protein
Mol. Mass.:
70168.43
Organism:
Rattus norvegicus (rat)
Description:
P31652
Residue:
630
  
Inhibitor
Name:
BDBM50029103
Synonyms:
2-(3-Chloro-phenyl)-1-methyl-ethylamine | CHEMBL149022
Type:
Small organic molecule
Emp. Form.:
C9H12ClN
Mol. Mass.:
169.651
SMILES:
CC(N)Cc1cccc(Cl)c1
: