Target
Muscarinic acetylcholine receptor M3
Ligand
BDBM50023229
Substrate
Meas. Tech.
ChEMBL_1457825 (CHEMBL3370303)
EC50
2100±n/a nM
Citation
 Gentry, PRKokubo, MBridges, TMNoetzel, MJCho, HPLamsal, ASmith, EChase, PHodder, PSNiswender, CMDaniels, JSConn, PJLindsley, CWWood, MR Development of a highly potent, novel M5 positive allosteric modulator (PAM) demonstrating CNS exposure: 1-((1H-indazol-5-yl)sulfoneyl)-N-ethyl-N-(2-(trifluoromethyl)benzyl)piperidine-4-carboxamide (ML380). J Med Chem 57:7804-10 (2014)  
Target
Name:
Muscarinic acetylcholine receptor M3
Synonyms:
ACM3_HUMAN Cholinergic, muscarinic M3 Muscarinic receptor M3 | RecName: Full=Muscarinic acetylcholine receptor M3
Type:
Enzyme
Mol. Mass.:
66151.03
Organism:
Homo sapiens (Human)
Description:
P20309
Residue:
590
  
Inhibitor
Name:
BDBM50023229
Synonyms:
CHEMBL3329755
Type:
Small organic molecule
Emp. Form.:
C23H25F3N4O3S
Mol. Mass.:
494.53
SMILES:
CCN(Cc1ccccc1C(F)(F)F)C(=O)C1CCN(CC1)S(=O)(=O)c1ccc2[nH]ncc2c1
: