Target
Muscarinic acetylcholine receptor M2
Ligand
BDBM50023229
Substrate
Meas. Tech.
ChEMBL_1457831 (CHEMBL3370309)
EC50
>30000±n/a nM
Citation
 Gentry, PRKokubo, MBridges, TMNoetzel, MJCho, HPLamsal, ASmith, EChase, PHodder, PSNiswender, CMDaniels, JSConn, PJLindsley, CWWood, MR Development of a highly potent, novel M5 positive allosteric modulator (PAM) demonstrating CNS exposure: 1-((1H-indazol-5-yl)sulfoneyl)-N-ethyl-N-(2-(trifluoromethyl)benzyl)piperidine-4-carboxamide (ML380). J Med Chem 57:7804-10 (2014)  
Target
Name:
Muscarinic acetylcholine receptor M2
Synonyms:
ACM2_RAT Chrm-2 | Chrm2
Type:
Enzyme Catalytic Domain
Mol. Mass.:
51555.53
Organism:
RAT
Description:
P10980
Residue:
466
  
Inhibitor
Name:
BDBM50023229
Synonyms:
CHEMBL3329755
Type:
Small organic molecule
Emp. Form.:
C23H25F3N4O3S
Mol. Mass.:
494.53
SMILES:
CCN(Cc1ccccc1C(F)(F)F)C(=O)C1CCN(CC1)S(=O)(=O)c1ccc2[nH]ncc2c1
: