Target
Hepatocyte growth factor receptor
Ligand
BDBM50440890
Substrate
Meas. Tech.
ChEMBL_1459611 (CHEMBL3369646)
IC50
210±n/a nM
Citation
 Jia, HDai, GWeng, JZhang, ZWang, QZhou, FJiao, LCui, YRen, YFan, SZhou, JQing, WGu, YWang, JSai, YSu, W Discovery of (S)-1-(1-(Imidazo[1,2-a]pyridin-6-yl)ethyl)-6-(1-methyl-1H-pyrazol-4-yl)-1H-[1,2,3]triazolo[4,5-b]pyrazine (volitinib) as a highly potent and selective mesenchymal-epithelial transition factor (c-Met) inhibitor in clinical development for treatment of cancer. J Med Chem 57:7577-89 (2014)  
Target
Name:
Hepatocyte growth factor receptor
Synonyms:
Hepatocyte growth factor receptor Hepatocyte growth factor receptor (c-MET) MET Met proto-oncogene (hepatocyte growth factor receptor) Tyrosine-protein kinase Met (c-Met) c-Met kinase
Type:
Protein
Mol. Mass.:
155559.73
Organism:
Homo sapiens (Human)
Description:
P08581
Residue:
1390
  
Inhibitor
Name:
BDBM50440890
Synonyms:
CHEMBL2431841 | US9066954, 341
Type:
Small organic molecule
Emp. Form.:
C19H15N7
Mol. Mass.:
341.3693
SMILES:
Cn1cc(cn1)-c1ccc2nnc(Cc3ccc4ncccc4c3)n2n1
: