Target
Nitric oxide synthase, endothelial
Ligand
BDBM50023386
Substrate
Meas. Tech.
ChEMBL_1446356 (CHEMBL3374895)
Ki
1150±n/a nM
Citation
 Jing, QLi, HRoman, LJMartásek, PPoulos, TLSilverman, RB Combination of chiral linkers with thiophenecarboximidamide heads to improve the selectivity of inhibitors of neuronal nitric oxide synthase. Bioorg Med Chem Lett 24:4504-10 (2014)  
Target
Name:
Nitric oxide synthase, endothelial
Synonyms:
Constitutive NOS Endothelial nitric oxide synthase NOS type III NOS3_BOVIN Nitric-oxide synthase, endothelial | cNOS
Type:
Enzyme
Mol. Mass.:
133292.26
Organism:
Bos taurus (bovine)
Description:
Recombinant eNOS overexpressed in E. coli was used in enzyme assays.
Residue:
1205
  
Inhibitor
Name:
BDBM50023386
Synonyms:
CHEMBL3327299
Type:
Small organic molecule
Emp. Form.:
C27H27N5O2S2
Mol. Mass.:
517.666
SMILES:
N=C(Nc1ccc(OC[C@@H]2C[C@H](CN2)Oc2cccc(NC(=N)c3cccs3)c2)cc1)c1cccs1
: