Target
Amine oxidase [flavin-containing] B
Ligand
BDBM50023746
Substrate
Meas. Tech.
ChEMBL_1434488 (CHEMBL3388874)
IC50
10.0±n/a nM
Citation
 Vianello, PBotrugno, OACappa, ACiossani, GDessanti, PMai, AMattevi, AMeroni, GMinucci, SThaler, FTortorici, MTrifiró, PValente, SVilla, MVarasi, MMercurio, C Synthesis, biological activity and mechanistic insights of 1-substituted cyclopropylamine derivatives: a novel class of irreversible inhibitors of histone demethylase KDM1A. Eur J Med Chem 86:352-63 (2014)  
Target
Name:
Amine oxidase [flavin-containing] B
Synonyms:
AOFB_HUMAN MAOB Monoamine oxidase type B (MAO B) Monoamine oxidase type B (MAOB)
Type:
Protein
Mol. Mass.:
58768.76
Organism:
Homo sapiens (Human)
Description:
P27338
Residue:
520
  
Inhibitor
Name:
BDBM50023746
Synonyms:
CHEMBL3330328
Type:
Small organic molecule
Emp. Form.:
C10H14ClN
Mol. Mass.:
183.678
SMILES:
Cl.C[C@@]1(N)C[C@H]1c1ccccc1
: