Target
5-hydroxytryptamine receptor 1A
Ligand
BDBM86757
Substrate
Meas. Tech.
ChEMBL_1438099 (CHEMBL3387900)
Ki
0.150000±n/a nM
Citation
 Kumar, JSMajo, VJPrabhakaran, JMann, JJ Synthesis and evaluation of arylpiperazines derivatives of 3,5-dioxo-(2H,4H)-1,2,4-triazine as 5-HT1AR ligands. Bioorg Med Chem Lett 24:4759-62 (2014)  
Target
Name:
5-hydroxytryptamine receptor 1A
Synonyms:
5-HT-1A 5-hydroxytryptamine receptor 1A (5-HT-1A) ADRB2RL1 Dopamine D2 receptor and serotonin 1a receptor HTR1A | Serotonin receptor 1A
Type:
Mol. Mass.:
46122.49
Organism:
Homo sapiens (Human)
Description:
Residue:
422
  
Inhibitor
Name:
BDBM86757
Synonyms:
CAS_0 [11C]MMP
Type:
Small organic molecule
Emp. Form.:
C19H27N5O3
Mol. Mass.:
373.4494
SMILES:
COc1ccccc1N1CCN(CCCCn2ncc(=O)n(C)c2=O)CC1
: