Target
4-hydroxyphenylpyruvate dioxygenase
Ligand
BDBM50024724
Substrate
Meas. Tech.
ChEMBL_1438115 (CHEMBL3388490)
Ki
58±n/a nM
Citation
 Xu, YLLin, HYCao, RJMing, ZZYang, WCYang, GF Pyrazolone-quinazolone hybrids: a novel class of human 4-hydroxyphenylpyruvate dioxygenase inhibitors. Bioorg Med Chem 22:5194-211 (2014)  
Target
Name:
4-hydroxyphenylpyruvate dioxygenase
Synonyms:
4-hydroxyphenylpyruvate dioxygenase 4HPPD HPPD_HUMAN | PPD
Type:
PROTEIN
Mol. Mass.:
44937.33
Organism:
Homo sapiens (Human)
Description:
ChEMBL_123
Residue:
393
  
Inhibitor
Name:
BDBM50024724
Synonyms:
CHEMBL3342600
Type:
Small organic molecule
Emp. Form.:
C21H18N4O3
Mol. Mass.:
374.3926
SMILES:
Cc1ccccc1-n1c(C)nc2ccc(cc2c1=O)C(=O)c1cnn(C)c1O
: