Target
Neuronal acetylcholine receptor subunit alpha-7
Ligand
BDBM50025028
Substrate
Meas. Tech.
ChEMBL_1442049 (CHEMBL3373417)
IC50
820±n/a nM
Citation
 Zlotos, DPTränkle, CHolzgrabe, UGündisch, DJensen, AA Semisynthetic analogues of toxiferine I and their pharmacological properties ata7 nAChRs, muscle-type nAChRs, and the allosteric binding site of muscarinic M2 receptors. J Nat Prod 77:2006-13 (2014)  
Target
Name:
Neuronal acetylcholine receptor subunit alpha-7
Synonyms:
ACHA7_HUMAN Cholinergic, Nicotinic Alpha7 Neuronal acetylcholine receptor protein alpha-7 subunit Nicotinic acetylcholine receptor alpha-7 (alpha7 nAChR)
Type:
Mol. Mass.:
56448.33
Organism:
Homo sapiens (Human)
Description:
CHRNA7 (NACHRA7)
Residue:
502
  
Inhibitor
Name:
BDBM50025028
Synonyms:
CHEMBL3337866
Type:
Small organic molecule
Emp. Form.:
C40H50I2N4
Mol. Mass.:
840.6607
SMILES:
[I-].[I-].[H][C@@]12C[C@@]3([H])[C@H](CC)C[N+]1(C)CC[C@@]21c2ccccc2N2\C=C4/[C@]5([H])N(\C=C3/[C@@]12[H])c1ccccc1[C@@]51CC[N+]2(C)C[C@@H](CC)[C@]4([H])C[C@@]12[H]
: