Target
Aminopeptidase N
Ligand
BDBM50025070
Substrate
Meas. Tech.
ChEMBL_1442055 (CHEMBL3373423)
Ki
1.5±n/a nM
Citation
 Vassiliou, SWeglarz-Tomczak, EBerlicki, LPawelczak, MNocek, BMulligan, RJoachimiak, AMucha, A Structure-guided, single-point modifications in the phosphinic dipeptide structure yield highly potent and selective inhibitors of neutral aminopeptidases. J Med Chem 57:8140-51 (2014)  
Target
Name:
Aminopeptidase N
Synonyms:
AMPN_PIG AP-M Alanyl aminopeptidase Aminopeptidase N (APN) Microsomal aminopeptidase pAPN
Type:
Protein
Mol. Mass.:
108810.25
Organism:
Sus scrofa (Pig)
Description:
P15145
Residue:
963
  
Inhibitor
Name:
BDBM50025070
Synonyms:
CHEMBL3355110
Type:
Small organic molecule
Emp. Form.:
C19H26N3O4P
Mol. Mass.:
391.4012
SMILES:
NCc1ccc(CC(CP(O)(=O)C(N)CCc2cccnc2)C(O)=O)cc1
: