Target
Cytosol aminopeptidase [33-68,L62W]
Ligand
BDBM50024597
Substrate
Meas. Tech.
ChEMBL_1442056 (CHEMBL3373424)
Ki
220±n/a nM
Citation
 Vassiliou, SWeglarz-Tomczak, EBerlicki, LPawelczak, MNocek, BMulligan, RJoachimiak, AMucha, A Structure-guided, single-point modifications in the phosphinic dipeptide structure yield highly potent and selective inhibitors of neutral aminopeptidases. J Med Chem 57:8140-51 (2014)  
Target
Name:
Cytosol aminopeptidase [33-68,L62W]
Synonyms:
AMPL_PIG LAP3 | Leucine aminopeptidase (LAP)
Type:
Enzyme
Mol. Mass.:
4015.44
Organism:
Sus scrofa (Pig)
Description:
P28839[33-68,L62W]
Residue:
36
  
Inhibitor
Name:
BDBM50024597
Synonyms:
(S)-1-Ammonium-3-methyl-butane-1-phosphonic acid anion | CHEMBL288165
Type:
Small organic molecule
Emp. Form.:
C5H14NO3P
Mol. Mass.:
167.1433
SMILES:
CC(C)C[C@@H]([NH3+])P(O)([O-])=O
: