Target
Sodium-dependent serotonin transporter
Ligand
BDBM50025219
Substrate
Meas. Tech.
ChEMBL_1442872 (CHEMBL3377150)
EC50
8.0±n/a nM
Citation
 Blough, BELandavazo, APartilla, JSDecker, AMPage, KMBaumann, MHRothman, RB Alpha-ethyltryptamines as dual dopamine-serotonin releasers. Bioorg Med Chem Lett 24:4754-8 (2014)  
Target
Name:
Sodium-dependent serotonin transporter
Synonyms:
5-HT Transporter 5HT transporter Anandamid membrane transporter, AMT Monoamine transporters; Norepinephrine & serotonin Slc6a4 Sodium-dependent serotonin transporter (SERT) | imipramine receptor
Type:
Multi-pass membrane protein
Mol. Mass.:
70168.43
Organism:
Rattus norvegicus (rat)
Description:
P31652
Residue:
630
  
Inhibitor
Name:
BDBM50025219
Synonyms:
CHEMBL3330643
Type:
Small organic molecule
Emp. Form.:
C10H11ClN2
Mol. Mass.:
194.661
SMILES:
NCCc1c[nH]c2c(Cl)cccc12
: