Target
Sodium-dependent serotonin transporter
Ligand
BDBM50025222
Substrate
Meas. Tech.
ChEMBL_1442872 (CHEMBL3377150)
EC50
33±n/a nM
Citation
 Blough, BELandavazo, APartilla, JSDecker, AMPage, KMBaumann, MHRothman, RB Alpha-ethyltryptamines as dual dopamine-serotonin releasers. Bioorg Med Chem Lett 24:4754-8 (2014)  
Target
Name:
Sodium-dependent serotonin transporter
Synonyms:
5-HT Transporter 5HT transporter Anandamid membrane transporter, AMT Monoamine transporters; Norepinephrine & serotonin Slc6a4 Sodium-dependent serotonin transporter (SERT) | imipramine receptor
Type:
Multi-pass membrane protein
Mol. Mass.:
70168.43
Organism:
Rattus norvegicus (rat)
Description:
P31652
Residue:
630
  
Inhibitor
Name:
BDBM50025222
Synonyms:
CHEMBL3330647
Type:
Small organic molecule
Emp. Form.:
C12H15ClN2
Mol. Mass.:
222.714
SMILES:
CCC(N)Cc1c[nH]c2ccc(Cl)cc12
: