Target
Sodium-dependent dopamine transporter
Ligand
BDBM50331288
Substrate
Meas. Tech.
ChEMBL_1442871 (CHEMBL3377149)
EC50
478±n/a nM
Citation
 Blough, BELandavazo, APartilla, JSDecker, AMPage, KMBaumann, MHRothman, RB Alpha-ethyltryptamines as dual dopamine-serotonin releasers. Bioorg Med Chem Lett 24:4754-8 (2014)  
Target
Name:
Sodium-dependent dopamine transporter
Synonyms:
DA transporter SC6A3_RAT Sodium-dependent dopamine transporter | Sodium-dependent dopamine transporter (DAT)
Type:
Multi-pass membrane protein
Mol. Mass.:
68749.45
Organism:
Rattus norvegicus (rat)
Description:
P23977
Residue:
619
  
Inhibitor
Name:
BDBM50331288
Synonyms:
2-(5-bromo-1H-indol-3-yl)ethanamine CHEMBL1288717
Type:
Small organic molecule
Emp. Form.:
C10H11BrN2
Mol. Mass.:
239.112
SMILES:
NCCc1c[nH]c2ccc(Br)cc12
: