Target
5-hydroxytryptamine receptor 2A
Ligand
BDBM50025197
Substrate
Meas. Tech.
ChEMBL_1442874 (CHEMBL3377152)
EC50
8.5±n/a nM
Citation
 Blough, BELandavazo, APartilla, JSDecker, AMPage, KMBaumann, MHRothman, RB Alpha-ethyltryptamines as dual dopamine-serotonin releasers. Bioorg Med Chem Lett 24:4754-8 (2014)  
Target
Name:
5-hydroxytryptamine receptor 2A
Synonyms:
5-HT-2 5-HT2A 5-hydroxytryptamine receptor 2A (5HT-2A) 5HT2A_HUMAN HTR2A | Serotonin receptor 2A
Type:
undefined
Mol. Mass.:
52607.65
Organism:
Homo sapiens (Human)
Description:
P28223
Residue:
471
  
Inhibitor
Name:
BDBM50025197
Synonyms:
CHEMBL96816
Type:
Small organic molecule
Emp. Form.:
C11H13FN2
Mol. Mass.:
192.2327
SMILES:
CC(N)Cc1c[nH]c2ccc(F)cc12
: